[gs-regression] local cluster regression mupdf 7992dd366101180c050f37167d91518c52cf025c

marcos.woehrmann at artifex.com marcos.woehrmann at artifex.com
Tue Jan 3 11:40:18 UTC 2012


7992dd3 More Memsqueezing fixes.
------------------------------------------------------------------------
commit 7992dd366101180c050f37167d91518c52cf025c
Author: Robin Watts <robin.watts at artifex.com>
Date:   Thu Dec 15 21:25:04 2011 +0000

    More Memsqueezing fixes.

Changed files:
fitz/filt_basic.c
fitz/filt_flate.c
fitz/stm_buffer.c
fitz/stm_read.c
pdf/pdf_page.c
pdf/pdf_stream.c


An error occurred that prevented the local cluster run from finishing:

i7b reports: compileFail: mupdf 
henrysx6 reports: compileFail: mupdf 
x6 reports: compileFail: mupdf 
kilometers reports: compileFail: mupdf 
i7a reports: compileFail: mupdf 
meters reports: compileFail: mupdf 
i7 reports: compileFail: mupdf 
peeves reports: compileFail: mupdf 
miles reports: compileFail: mupdf 
macpro reports: compileFail: mupdf 



i7b log:

gcc (Debian 4.3.2-1.1) 4.3.2
Copyright (C) 2008 Free Software Foundation, Inc.
This is free software; see the source for copying conditions.  There is NO
warranty; not even for MERCHANTABILITY or FITNESS FOR A PARTICULAR PURPOSE.

compileFail: mupdf 


makemupdf.out (last 50 lines):

thirdparty/openjpeg-1.4/libopenjpeg/dwt.c:573: warning: cast from pointer to integer of different size
thirdparty/openjpeg-1.4/libopenjpeg/dwt.c:573: warning: cast from pointer to integer of different size
    CC build/debug/opj_tgt.o
    CC build/debug/zlib_compress.o
    CC build/debug/zlib_adler32.o
    CC build/debug/zlib_crc32.o
    CC build/debug/zlib_deflate.o
    CC build/debug/zlib_inffast.o
    CC build/debug/zlib_inftrees.o
    CC build/debug/zlib_trees.o
    CC build/debug/zlib_zutil.o
    CC build/debug/zlib_uncompr.o
    CC build/debug/base_context.o
thirdparty/openjpeg-1.4/libopenjpeg/tcd.c: In function 'tcd_decode_tile':
thirdparty/openjpeg-1.4/libopenjpeg/tcd.c:1466: warning: implicit declaration of function 'lrintf'
thirdparty/openjpeg-1.4/libopenjpeg/tcd.c:1466: warning: incompatible implicit declaration of built-in function 'lrintf'
    CC build/debug/base_error.o
    CC build/debug/base_geometry.o
    CC build/debug/base_time.o
    CC build/debug/crypt_aes.o
    CC build/debug/crypt_arc4.o
    CC build/debug/crypt_sha2.o
    CC build/debug/dev_bbox.o
    CC build/debug/dev_list.o
    CC build/debug/dev_trace.o
    CC build/debug/filt_basic.o
    CC build/debug/filt_dctd.o
    CC build/debug/filt_faxd.o
    CC build/debug/filt_flate.o
    CC build/debug/filt_jbig2d.o
    CC build/debug/filt_jpxd.o
    CC build/debug/filt_lzwd.o
    CC build/debug/memento.o
fitz/memento.c:1098:24: error: macro "Memento_stats" passed 1 arguments, but takes just 0
fitz/memento.c:1099: error: expected '=', ',', ';', 'asm' or '__attribute__' before '{' token
    CC build/debug/res_bitmap.o
    CC build/debug/res_colorspace.o
make: *** [build/debug/memento.o] Error 1
make: *** Waiting for unfinished jobs....

    AR build/debug/libfreetype.a
    AR build/debug/libjbig2dec.a
    AR build/debug/libjpeg.a
    AR build/debug/libopenjpeg.a
    AR build/debug/libz.a
    CC build/debug/memento.o
fitz/memento.c:1098:24: error: macro "Memento_stats" passed 1 arguments, but takes just 0
fitz/memento.c:1099: error: expected '=', ',', ';', 'asm' or '__attribute__' before '{' token
make: *** [build/debug/memento.o] Error 1


i7b stdout:

cp: cannot stat `/home/marcos/cluster/mupdf/build/*/pdfdraw': No such file or directory


henrysx6 log:

gcc (Ubuntu/Linaro 4.4.4-14ubuntu5) 4.4.5
Copyright (C) 2010 Free Software Foundation, Inc.
This is free software; see the source for copying conditions.  There is NO
warranty; not even for MERCHANTABILITY or FITNESS FOR A PARTICULAR PURPOSE.

compileFail: mupdf 


makemupdf.out (last 50 lines):

    CC build/debug/zlib_trees.o
    CC build/debug/zlib_uncompr.o
    CC build/debug/zlib_zutil.o
    CC build/debug/base_context.o
    CC build/debug/base_error.o
    CC build/debug/base_geometry.o
    CC build/debug/base_getopt.o
    CC build/debug/base_hash.o
    CC build/debug/base_memory.o
    CC build/debug/base_object.o
    CC build/debug/base_string.o
    CC build/debug/base_time.o
    CC build/debug/crypt_aes.o
    CC build/debug/crypt_arc4.o
    CC build/debug/crypt_md5.o
    CC build/debug/crypt_sha2.o
    CC build/debug/dev_bbox.o
    CC build/debug/dev_list.o
    CC build/debug/dev_null.o
    CC build/debug/dev_text.o
    CC build/debug/dev_trace.o
    CC build/debug/doc_outline.o
    CC build/debug/filt_basic.o
    CC build/debug/filt_dctd.o
    CC build/debug/filt_faxd.o
    CC build/debug/filt_flate.o
    CC build/debug/filt_jbig2d.o
    CC build/debug/filt_jpxd.o
    CC build/debug/filt_lzwd.o
    CC build/debug/filt_predict.o
    CC build/debug/memento.o
    CC build/debug/res_bitmap.o
    CC build/debug/res_colorspace.o
fitz/memento.c:1098: error: macro "Memento_stats" passed 1 arguments, but takes just 0
fitz/memento.c:1099: error: expected ‘=’, ‘,’, ‘;’, ‘asm’ or ‘__attribute__’ before ‘{’ token
    CC build/debug/res_font.o
    CC build/debug/res_halftone.o
make: *** [build/debug/memento.o] Error 1
make: *** Waiting for unfinished jobs....

    AR build/debug/libfreetype.a
    AR build/debug/libjbig2dec.a
    AR build/debug/libjpeg.a
    AR build/debug/libopenjpeg.a
    AR build/debug/libz.a
    CC build/debug/memento.o
fitz/memento.c:1098: error: macro "Memento_stats" passed 1 arguments, but takes just 0
fitz/memento.c:1099: error: expected ‘=’, ‘,’, ‘;’, ‘asm’ or ‘__attribute__’ before ‘{’ token
make: *** [build/debug/memento.o] Error 1


henrysx6 stdout:

fatal: object 3562831bfbb270c2cc4726780426290118771c66 is corrupted
fatal: object 3562831bfbb270c2cc4726780426290118771c66 is corrupted
cp: cannot stat `/home/marcosw/cluster/mupdf/build/*/pdfdraw': No such file or directory


x6 log:

gcc (Ubuntu 4.4.3-4ubuntu5) 4.4.3
Copyright (C) 2009 Free Software Foundation, Inc.
This is free software; see the source for copying conditions.  There is NO
warranty; not even for MERCHANTABILITY or FITNESS FOR A PARTICULAR PURPOSE.

compileFail: mupdf 


makemupdf.out (last 50 lines):

    CC build/debug/zlib_zutil.o
    CC build/debug/base_context.o
    CC build/debug/base_error.o
    CC build/debug/base_geometry.o
    CC build/debug/base_getopt.o
    CC build/debug/base_hash.o
    CC build/debug/base_memory.o
    CC build/debug/base_object.o
    CC build/debug/base_string.o
    CC build/debug/base_time.o
    CC build/debug/crypt_aes.o
    CC build/debug/crypt_arc4.o
    CC build/debug/crypt_md5.o
    CC build/debug/crypt_sha2.o
    CC build/debug/dev_bbox.o
    CC build/debug/dev_list.o
    CC build/debug/dev_null.o
    CC build/debug/dev_text.o
    CC build/debug/dev_trace.o
    CC build/debug/doc_outline.o
    CC build/debug/filt_basic.o
    CC build/debug/filt_dctd.o
    CC build/debug/filt_faxd.o
    CC build/debug/filt_flate.o
    CC build/debug/filt_jbig2d.o
    CC build/debug/filt_jpxd.o
    CC build/debug/filt_lzwd.o
    CC build/debug/filt_predict.o
    CC build/debug/memento.o
    CC build/debug/res_bitmap.o
    CC build/debug/res_colorspace.o
    CC build/debug/res_font.o
    CC build/debug/res_halftone.o
    CC build/debug/res_path.o
    CC build/debug/res_pixmap.o
fitz/memento.c:1098:24: error: macro "Memento_stats" passed 1 arguments, but takes just 0
fitz/memento.c:1099: error: expected '=', ',', ';', 'asm' or '__attribute__' before '{' token
make: *** [build/debug/memento.o] Error 1
make: *** Waiting for unfinished jobs....

    AR build/debug/libfreetype.a
    AR build/debug/libjbig2dec.a
    AR build/debug/libjpeg.a
    AR build/debug/libopenjpeg.a
    AR build/debug/libz.a
    CC build/debug/memento.o
fitz/memento.c:1098:24: error: macro "Memento_stats" passed 1 arguments, but takes just 0
fitz/memento.c:1099: error: expected '=', ',', ';', 'asm' or '__attribute__' before '{' token
make: *** [build/debug/memento.o] Error 1


x6 stdout:

cp: cannot stat `/home/marcos/cluster/mupdf/build/*/pdfdraw': No such file or directory


kilometers log:

gcc (Ubuntu 4.4.3-4ubuntu5) 4.4.3
Copyright (C) 2009 Free Software Foundation, Inc.
This is free software; see the source for copying conditions.  There is NO
warranty; not even for MERCHANTABILITY or FITNESS FOR A PARTICULAR PURPOSE.

compileFail: mupdf 


makemupdf.out (last 50 lines):

    CC build/debug/zlib_trees.o
    CC build/debug/zlib_uncompr.o
    CC build/debug/zlib_zutil.o
    CC build/debug/base_context.o
    CC build/debug/base_error.o
    CC build/debug/base_geometry.o
    CC build/debug/base_getopt.o
    CC build/debug/base_hash.o
    CC build/debug/base_memory.o
    CC build/debug/base_object.o
    CC build/debug/base_string.o
    CC build/debug/base_time.o
    CC build/debug/crypt_aes.o
    CC build/debug/crypt_arc4.o
    CC build/debug/crypt_md5.o
    CC build/debug/crypt_sha2.o
    CC build/debug/dev_bbox.o
    CC build/debug/dev_list.o
    CC build/debug/dev_null.o
    CC build/debug/dev_text.o
    CC build/debug/dev_trace.o
    CC build/debug/doc_outline.o
    CC build/debug/filt_basic.o
    CC build/debug/filt_dctd.o
    CC build/debug/filt_faxd.o
    CC build/debug/filt_flate.o
    CC build/debug/filt_jbig2d.o
    CC build/debug/filt_jpxd.o
    CC build/debug/filt_lzwd.o
    CC build/debug/filt_predict.o
    CC build/debug/memento.o
    CC build/debug/res_bitmap.o
    CC build/debug/res_colorspace.o
    CC build/debug/res_font.o
fitz/memento.c:1098:24: error: macro "Memento_stats" passed 1 arguments, but takes just 0
fitz/memento.c:1099: error: expected '=', ',', ';', 'asm' or '__attribute__' before '{' token
    CC build/debug/res_halftone.o
make: *** [build/debug/memento.o] Error 1
make: *** Waiting for unfinished jobs....

    AR build/debug/libfreetype.a
    AR build/debug/libjbig2dec.a
    AR build/debug/libjpeg.a
    AR build/debug/libopenjpeg.a
    AR build/debug/libz.a
    CC build/debug/memento.o
fitz/memento.c:1098:24: error: macro "Memento_stats" passed 1 arguments, but takes just 0
fitz/memento.c:1099: error: expected '=', ',', ';', 'asm' or '__attribute__' before '{' token
make: *** [build/debug/memento.o] Error 1


kilometers stdout:

cp: cannot stat `/home/marcos/cluster/mupdf/build/*/pdfdraw': No such file or directory


i7a log:

gcc (Debian 4.3.2-1.1) 4.3.2
Copyright (C) 2008 Free Software Foundation, Inc.
This is free software; see the source for copying conditions.  There is NO
warranty; not even for MERCHANTABILITY or FITNESS FOR A PARTICULAR PURPOSE.

compileFail: mupdf 


makemupdf.out (last 50 lines):

    CC build/debug/opj_openjpeg.o
    CC build/debug/opj_mqc.o
    CC build/debug/opj_pi.o
    CC build/debug/opj_raw.o
    CC build/debug/opj_t1.o
    CC build/debug/opj_t2.o
    CC build/debug/opj_tcd.o
    CC build/debug/opj_tgt.o
    CC build/debug/zlib_adler32.o
    CC build/debug/zlib_compress.o
    CC build/debug/zlib_crc32.o
    CC build/debug/zlib_deflate.o
    CC build/debug/zlib_inffast.o
    CC build/debug/zlib_inflate.o
    CC build/debug/zlib_inftrees.o
    CC build/debug/zlib_trees.o
    CC build/debug/zlib_uncompr.o
    CC build/debug/zlib_zutil.o
    CC build/debug/crypt_arc4.o
    CC build/debug/crypt_md5.o
    CC build/debug/crypt_sha2.o
    CC build/debug/dev_bbox.o
    CC build/debug/dev_list.o
    CC build/debug/dev_null.o
    CC build/debug/dev_text.o
    CC build/debug/dev_trace.o
    CC build/debug/doc_outline.o
    CC build/debug/filt_basic.o
    CC build/debug/filt_dctd.o
    CC build/debug/filt_jbig2d.o
    CC build/debug/filt_jpxd.o
    CC build/debug/filt_lzwd.o
    CC build/debug/filt_predict.o
    CC build/debug/memento.o
fitz/memento.c:1098:24: error: macro "Memento_stats" passed 1 arguments, but takes just 0
fitz/memento.c:1099: error: expected '=', ',', ';', 'asm' or '__attribute__' before '{' token
make: *** [build/debug/memento.o] Error 1
make: *** Waiting for unfinished jobs....
    CC build/debug/res_bitmap.o

    AR build/debug/libfreetype.a
    AR build/debug/libjbig2dec.a
    AR build/debug/libjpeg.a
    AR build/debug/libopenjpeg.a
    AR build/debug/libz.a
    CC build/debug/memento.o
fitz/memento.c:1098:24: error: macro "Memento_stats" passed 1 arguments, but takes just 0
fitz/memento.c:1099: error: expected '=', ',', ';', 'asm' or '__attribute__' before '{' token
make: *** [build/debug/memento.o] Error 1


i7a stdout:

cp: cannot stat `/home/marcos/cluster/mupdf/build/*/pdfdraw': No such file or directory


meters log:

gcc (Ubuntu 4.4.3-4ubuntu5) 4.4.3
Copyright (C) 2009 Free Software Foundation, Inc.
This is free software; see the source for copying conditions.  There is NO
warranty; not even for MERCHANTABILITY or FITNESS FOR A PARTICULAR PURPOSE.

compileFail: mupdf 


makemupdf.out (last 50 lines):

    CC build/debug/zlib_inftrees.o
    CC build/debug/zlib_trees.o
    CC build/debug/zlib_uncompr.o
    CC build/debug/zlib_zutil.o
    CC build/debug/base_context.o
    CC build/debug/base_error.o
    CC build/debug/base_geometry.o
    CC build/debug/base_getopt.o
    CC build/debug/base_hash.o
    CC build/debug/base_memory.o
    CC build/debug/base_object.o
    CC build/debug/base_string.o
    CC build/debug/base_time.o
    CC build/debug/crypt_aes.o
    CC build/debug/crypt_arc4.o
    CC build/debug/crypt_md5.o
    CC build/debug/crypt_sha2.o
    CC build/debug/dev_bbox.o
    CC build/debug/dev_list.o
    CC build/debug/dev_null.o
    CC build/debug/dev_text.o
    CC build/debug/dev_trace.o
    CC build/debug/doc_outline.o
    CC build/debug/filt_basic.o
    CC build/debug/filt_dctd.o
    CC build/debug/filt_faxd.o
    CC build/debug/filt_flate.o
    CC build/debug/filt_jbig2d.o
    CC build/debug/filt_jpxd.o
    CC build/debug/filt_lzwd.o
    CC build/debug/filt_predict.o
    CC build/debug/memento.o
    CC build/debug/res_bitmap.o
    CC build/debug/res_colorspace.o
fitz/memento.c:1098:24: error: macro "Memento_stats" passed 1 arguments, but takes just 0
fitz/memento.c:1099: error: expected '=', ',', ';', 'asm' or '__attribute__' before '{' token
    CC build/debug/res_font.o
make: *** [build/debug/memento.o] Error 1
make: *** Waiting for unfinished jobs....

    AR build/debug/libfreetype.a
    AR build/debug/libjbig2dec.a
    AR build/debug/libjpeg.a
    AR build/debug/libopenjpeg.a
    AR build/debug/libz.a
    CC build/debug/memento.o
fitz/memento.c:1098:24: error: macro "Memento_stats" passed 1 arguments, but takes just 0
fitz/memento.c:1099: error: expected '=', ',', ';', 'asm' or '__attribute__' before '{' token
make: *** [build/debug/memento.o] Error 1


meters stdout:

cp: cannot stat `/home/marcos/cluster/mupdf/build/*/pdfdraw': No such file or directory
You're not allowed to run 'touch /home/regression/cluster/meters.fail'


i7 log:

gcc (Ubuntu 4.4.3-4ubuntu5) 4.4.3
Copyright (C) 2009 Free Software Foundation, Inc.
This is free software; see the source for copying conditions.  There is NO
warranty; not even for MERCHANTABILITY or FITNESS FOR A PARTICULAR PURPOSE.

compileFail: mupdf 


makemupdf.out (last 50 lines):

    CC build/debug/zlib_trees.o
    CC build/debug/zlib_uncompr.o
    CC build/debug/zlib_zutil.o
    CC build/debug/base_context.o
    CC build/debug/base_error.o
    CC build/debug/base_geometry.o
    CC build/debug/base_getopt.o
    CC build/debug/base_hash.o
    CC build/debug/base_memory.o
    CC build/debug/base_object.o
    CC build/debug/base_string.o
    CC build/debug/base_time.o
    CC build/debug/crypt_aes.o
    CC build/debug/crypt_arc4.o
    CC build/debug/crypt_md5.o
    CC build/debug/crypt_sha2.o
    CC build/debug/dev_bbox.o
    CC build/debug/dev_list.o
    CC build/debug/dev_null.o
    CC build/debug/dev_text.o
    CC build/debug/dev_trace.o
    CC build/debug/doc_outline.o
    CC build/debug/filt_basic.o
    CC build/debug/filt_dctd.o
    CC build/debug/filt_faxd.o
    CC build/debug/filt_flate.o
    CC build/debug/filt_jbig2d.o
    CC build/debug/filt_jpxd.o
    CC build/debug/filt_lzwd.o
    CC build/debug/filt_predict.o
    CC build/debug/memento.o
    CC build/debug/res_bitmap.o
    CC build/debug/res_colorspace.o
    CC build/debug/res_font.o
fitz/memento.c:1098:24: error: macro "Memento_stats" passed 1 arguments, but takes just 0
fitz/memento.c:1099: error: expected '=', ',', ';', 'asm' or '__attribute__' before '{' token
    CC build/debug/res_halftone.o
make: *** [build/debug/memento.o] Error 1
make: *** Waiting for unfinished jobs....

    AR build/debug/libfreetype.a
    AR build/debug/libjbig2dec.a
    AR build/debug/libjpeg.a
    AR build/debug/libopenjpeg.a
    AR build/debug/libz.a
    CC build/debug/memento.o
fitz/memento.c:1098:24: error: macro "Memento_stats" passed 1 arguments, but takes just 0
fitz/memento.c:1099: error: expected '=', ',', ';', 'asm' or '__attribute__' before '{' token
make: *** [build/debug/memento.o] Error 1


i7 stdout:

cp: cannot stat `/home/marcos/cluster/mupdf/build/*/pdfdraw': No such file or directory


peeves log:

gcc (Ubuntu 4.4.1-4ubuntu9) 4.4.1
Copyright (C) 2009 Free Software Foundation, Inc.
This is free software; see the source for copying conditions.  There is NO
warranty; not even for MERCHANTABILITY or FITNESS FOR A PARTICULAR PURPOSE.

compileFail: mupdf 


makemupdf.out (last 50 lines):

    CC build/debug/zlib_trees.o
    CC build/debug/zlib_uncompr.o
    CC build/debug/zlib_zutil.o
    CC build/debug/base_context.o
    CC build/debug/base_error.o
    CC build/debug/base_getopt.o
    CC build/debug/base_hash.o
    CC build/debug/base_memory.o
    CC build/debug/base_object.o
    CC build/debug/base_geometry.o
    CC build/debug/base_string.o
    CC build/debug/base_time.o
    CC build/debug/crypt_aes.o
    CC build/debug/crypt_arc4.o
    CC build/debug/crypt_md5.o
    CC build/debug/crypt_sha2.o
    CC build/debug/dev_list.o
    CC build/debug/dev_text.o
    CC build/debug/dev_trace.o
    CC build/debug/doc_outline.o
    CC build/debug/dev_bbox.o
    CC build/debug/dev_null.o
    CC build/debug/filt_basic.o
    CC build/debug/filt_dctd.o
    CC build/debug/filt_faxd.o
    CC build/debug/filt_jbig2d.o
    CC build/debug/filt_flate.o
    CC build/debug/filt_jpxd.o
    CC build/debug/filt_lzwd.o
    CC build/debug/filt_predict.o
    CC build/debug/memento.o
    CC build/debug/res_bitmap.o
    CC build/debug/res_colorspace.o
    CC build/debug/res_font.o
    CC build/debug/res_halftone.o
fitz/memento.c:1098:24: error: macro "Memento_stats" passed 1 arguments, but takes just 0
fitz/memento.c:1099: error: expected '=', ',', ';', 'asm' or '__attribute__' before '{' token
make: *** [build/debug/memento.o] Error 1
make: *** Waiting for unfinished jobs....

    AR build/debug/libfreetype.a
    AR build/debug/libjbig2dec.a
    AR build/debug/libjpeg.a
    AR build/debug/libopenjpeg.a
    AR build/debug/libz.a
    CC build/debug/memento.o
fitz/memento.c:1098:24: error: macro "Memento_stats" passed 1 arguments, but takes just 0
fitz/memento.c:1099: error: expected '=', ',', ';', 'asm' or '__attribute__' before '{' token
make: *** [build/debug/memento.o] Error 1


peeves stdout:

ssh_exchange_identification: Connection closed by remote host
cp: cannot stat `/home/marcos/cluster/mupdf/build/*/pdfdraw': No such file or directory


miles log:

gcc (Ubuntu 4.4.3-4ubuntu5) 4.4.3
Copyright (C) 2009 Free Software Foundation, Inc.
This is free software; see the source for copying conditions.  There is NO
warranty; not even for MERCHANTABILITY or FITNESS FOR A PARTICULAR PURPOSE.

compileFail: mupdf 


makemupdf.out (last 50 lines):

    CC build/debug/zlib_inflate.o
    CC build/debug/zlib_inftrees.o
    CC build/debug/zlib_trees.o
    CC build/debug/zlib_uncompr.o
    CC build/debug/zlib_zutil.o
    CC build/debug/base_context.o
    CC build/debug/base_error.o
    CC build/debug/base_geometry.o
    CC build/debug/base_getopt.o
    CC build/debug/base_hash.o
    CC build/debug/base_memory.o
    CC build/debug/base_object.o
    CC build/debug/base_string.o
    CC build/debug/crypt_aes.o
    CC build/debug/base_time.o
    CC build/debug/crypt_arc4.o
    CC build/debug/crypt_md5.o
    CC build/debug/crypt_sha2.o
    CC build/debug/dev_bbox.o
    CC build/debug/dev_list.o
    CC build/debug/dev_null.o
    CC build/debug/dev_text.o
    CC build/debug/dev_trace.o
    CC build/debug/doc_outline.o
    CC build/debug/filt_basic.o
    CC build/debug/filt_dctd.o
    CC build/debug/filt_faxd.o
    CC build/debug/filt_flate.o
    CC build/debug/filt_jbig2d.o
    CC build/debug/filt_jpxd.o
    CC build/debug/filt_lzwd.o
    CC build/debug/filt_predict.o
    CC build/debug/memento.o
    CC build/debug/res_bitmap.o
fitz/memento.c:1098:24: error: macro "Memento_stats" passed 1 arguments, but takes just 0
fitz/memento.c:1099: error: expected '=', ',', ';', 'asm' or '__attribute__' before '{' token
    CC build/debug/res_colorspace.o
make: *** [build/debug/memento.o] Error 1
make: *** Waiting for unfinished jobs....

    AR build/debug/libfreetype.a
    AR build/debug/libjbig2dec.a
    AR build/debug/libjpeg.a
    AR build/debug/libopenjpeg.a
    AR build/debug/libz.a
    CC build/debug/memento.o
fitz/memento.c:1098:24: error: macro "Memento_stats" passed 1 arguments, but takes just 0
fitz/memento.c:1099: error: expected '=', ',', ';', 'asm' or '__attribute__' before '{' token
make: *** [build/debug/memento.o] Error 1


miles stdout:

cp: cannot stat `/home/marcos/cluster/mupdf/build/*/pdfdraw': No such file or directory


macpro log:

i686-apple-darwin10-gcc-4.2.1 (GCC) 4.2.1 (Apple Inc. build 5664)
Copyright (C) 2007 Free Software Foundation, Inc.
This is free software; see the source for copying conditions.  There is NO
warranty; not even for MERCHANTABILITY or FITNESS FOR A PARTICULAR PURPOSE.

compileFail: mupdf 


makemupdf.out (last 50 lines):

    CC build/debug/base_memory.o
    CC build/debug/base_object.o
    CC build/debug/base_string.o


More information about the gs-regression mailing list