[gs-regression] error running regression

marcos.woehrmann at artifex.com marcos.woehrmann at artifex.com
Wed Jan 18 01:58:11 UTC 2012


Ghostscript update failed during make

stdout log:

gcc -O2 -Wall -Wstrict-prototypes -Wundef -Wmissing-declarations -Wmissing-prototypes -Wwrite-strings -Wno-strict-aliasing -Wdeclaration-after-statement -fno-builtin -fno-common -DHAVE_STDINT_H=1 -DHAVE_SYS_TIME_H=1 -DGX_COLOR_INDEX_TYPE="unsigned long int"    -I./base -o ./obj/aux/genconf ./base/genconf.c
gcc -O2 -Wall -Wstrict-prototypes -Wundef -Wmissing-declarations -Wmissing-prototypes -Wwrite-strings -Wno-strict-aliasing -Wdeclaration-after-statement -fno-builtin -fno-common -DHAVE_STDINT_H=1 -DHAVE_SYS_TIME_H=1 -DGX_COLOR_INDEX_TYPE="unsigned long int"    -I./base -o ./obj/aux/echogs ./base/echogs.c

stderr log:

./base/echogs.c: In function 'main':
./base/echogs.c:169: error: nested functions are disabled, use -fnested-functions to re-enable
./base/echogs.c:169: error: expected '=', ',', ';', 'asm' or '__attribute__' before 'if'
./base/echogs.c:181: error: 'i' undeclared (first use in this function)
./base/echogs.c:181: error: (Each undeclared identifier is reported only once
./base/echogs.c:181: error: for each function it appears in.)
make: *** [obj/aux/echogs] Error 1


More information about the gs-regression mailing list